{"text_format":"1","workbook":"xlsx","n_sheets":5,"sheets":["I. Calculadora - Oferta","I. Calculadora Fondeo UI","II. Calculadora Fondeo UP","III. Calculadora Fondeo USD","Títulos Elegibles"],"not_rendered":{"charts":0,"images":0,"macros":1,"external_links":0,"defined_names":7,"comments":0,"pivot_tables":0},"unopened":[],"bounds":{"document_bytes":16777216,"sheet_cells":100000,"rows_first":2000,"rows_last":500,"rows_between":2000,"halvings":0,"cell_chars":16384,"cell_head_chars":4096},"cells_cut":0,"cells_raw":0,"read":"whole","date_system":"1900"}

{"sheet":"I. Calculadora - Oferta","index":0,"n_rows":71,"n_cols":28,"rows_kept":71,"cut":false,"hidden":false,"merged":[[18,6,18,7],[18,16,18,17],[18,26,18,27]]}
[]
[null,"Serie I  (UI) - Calculadora Yield / Precio - ISIN UYFFCN179UI0",null,null,null,null,null,null,null,null,null,"Serie II  (UP) - Calculadora Yield / Precio - ISIN UYFFCN180UP3",null,null,null,null,null,null,null,null,null,"Serie III  (USD) - Calculadora Yield / Precio - ISIN UYFFCN181US5"]
[]
[null,"I. Datos del Instrumento",null,null,"II. Datos integración/adjudicación",null,null,null,null,null,null,"I. Datos del Instrumento",null,null,"II. Datos integración/adjudicación",null,null,null,null,null,null,"I. Datos del Instrumento",null,null,"II. Datos integración/adjudicación"]
[null,"Fecha Emitido","2023-12-14",null,"Fecha Cierre","2024-04-25",null,null,null,null,null,"Fecha Emitido",{"$f":"+C5","v":"2023-12-14"},null,"Fecha Cierre",{"$f":"+F5","v":"2024-04-25"},null,null,null,null,null,"Fecha Emitido",{"$f":"+C5","v":"2023-12-14"},null,"Fecha Cierre",{"$f":"+F5","v":"2024-04-25"}]
[null,"Cupon (UI)",3.7999999999999999E-2,null,null,null,null,null,null,null,null,"Cupon (UP)",2.2499999999999999E-2,null,null,null,null,null,null,null,null,"Cupon (USD)",5.7000000000000002E-2]
[null,"Dias Devengados",{"$f":"DAYS360(C5,B20,0)","v":131},null,"Precio ====>",100,null,null,null,null,null,"Dias Devengados",{"$f":"DAYS360(M5,L20)","v":131},null,"Precio ====>",100,null,null,null,null,null,"Dias Devengados",{"$f":"DAYS360(W5,V20)","v":131},null,"Precio ====>",100]
[null,"Cupon Devengado ",{"$f":"C6*C7/360","v":1.3827777777777777E-2},null,"TIR ",{"$f":"+XIRR(F20:F71,B20:B71)","v":3.7263610959053048E-2},null,null,null,null,null,"Cupon Devengado ",{"$f":"M6*M7/360","v":8.1874999999999986E-3},null,"TIR ",{"$f":"+XIRR(P20:P71,L20:L71)","v":2.2058442234992981E-2},null,null,null,null,null,"Cupon Devengado ",{"$f":"W6*W7/360","v":2.0741666666666669E-2},null,"TIR ",{"$f":"+XIRR(Z20:Z71,V20:V71)","v":5.5893847346305842E-2}]
[null,null,null,null,"YIELD",{"$f":"+(((1+F8)^(0.5))-1)*2","v":3.6922787892612163E-2},null,null,null,null,null,null,null,null,"YIELD",{"$f":"+(((1+P8)^(0.5))-1)*2","v":2.1938121936468047E-2},null,null,null,null,null,null,null,null,"YIELD",{"$f":"+(((1+Z8)^(0.5))-1)*2","v":5.5133910329256963E-2}]
[null,null,null,null,"DURATION",{"$f":"+H20/G20","v":13.293584728191625},null,null,null,null,null,null,null,null,"DURATION",{"$f":"+R20/Q20","v":15.068966751257561},null,null,null,null,null,null,null,null,"DURATION",{"$f":"+AB20/AA20","v":11.544792882056564}]
[]
[null,"III. Monto a ser Integrado",null,null,null,null,null,null,null,null,null,"III. Monto a ser Integrado",null,null,null,null,null,null,null,null,null,"III. Monto a ser Integrado"]
[null,"Valor Nominal Monto adjudicado",40000000,"UI",null,null,null,null,null,null,null,"Valor Nominal Monto adjudicado",15000000,"UP",null,null,null,null,null,null,null,"Valor Nominal Monto adjudicado",1000000,"USD"]
[null,"Nominal * Precio",{"$f":"C13*F7/100","v":40000000},null,null,null,null,null,null,null,null,"Nominal * Precio",{"$f":"M13*P7/100","v":15000000},null,null,null,null,null,null,null,null,"Nominal * Precio",{"$f":"W13*Z7/100","v":1000000}]
[null,"Cupon Devengado",{"$f":"C13*C8","v":553111.11111111112},null,null,null,null,null,null,null,null,"Cupon Devengado",{"$f":"M13*M8","v":122812.49999999999},null,null,null,null,null,null,null,null,"Cupon Devengado",{"$f":"W13*W8","v":20741.666666666668}]
[null,"Total UI a Fondear",{"$f":"C15+C14","v":40553111.111111112},null,null,null,null,null,null,null,null,"Total UP a Fondear",{"$f":"M15+M14","v":15122812.5},null,null,null,null,null,null,null,null,"Total USD a Fondear",{"$f":"W15+W14","v":1020741.6666666666}]
[]
[]
[null,"Fecha","Variación capital","Saldo","Intereses","FF","Cálculo Duration",null,null,null,null,"Fecha","Variación capital","Saldo","Intereses","FF","Cálculo Duration",null,null,null,null,"Fecha","Variación capital","Saldo","Intereses","FF","Cálculo Duration"]
[null,{"$f":"+F5","v":"2024-04-25"},0,1,null,{"$f":"-F7%-C8","v":-1.0138277777777778},{"$f":"+SUM(G21:G71)*100","v":101.41683838479376},{"$f":"+SUM(H21:H71)*100","v":1348.1933339335726},null,null,null,{"$f":"+P5","v":"2024-04-25"},0,1,null,{"$f":"-P7%-M8","v":-1.0081875},{"$f":"+SUM(Q21:Q71)*100","v":100.84162259554812},{"$f":"+SUM(R21:R71)*100","v":1519.5790580351777},null,null,null,{"$f":"+Z5","v":"2024-04-25"},0,1,null,{"$f":"-Z7%-W8","v":-1.0207416666666667},{"$f":"+SUM(AA21:AA71)*100","v":102.11851511513422},{"$f":"+SUM(AB21:AB71)*100","v":1178.9371064273871}]
{"$rows_left_out":52}
{"sheet":"I. Calculadora Fondeo UI","index":1,"n_rows":33,"n_cols":11,"rows_kept":33,"cut":false,"hidden":false,"merged":[]}
[]
[null,"Serie I  (UI) - Calculadora Fondeo"]
[]
[null,"I. Instrumentos Elegibles y Montos"]
[]
[null,null,null,null,null,null,null,null,"Valor","Valor "]
[null,"Codigo Título","Instrumentos","Moneda del Intrumento","Nominal","Precio","Cupón","Devengado cupón corrido","(moneda base)","(UI)"]
[null,{"$f":"+IFERROR(VLOOKUP(C8,'Títulos Elegibles'!$A$3:$B$9,2,FALSE),\"\")","v":"T"},"FF CORPORACION VIAL DEL URUGUAY I US SIII",{"$f":"IFERROR(+VLOOKUP(C8,'Títulos Elegibles'!$A$3:$I$9,6,FALSE),\"\")","v":"USD"},2000000,{"$f":"+IFERROR(VLOOKUP($C8,'Títulos Elegibles'!$A$3:$H$9,8,FALSE),\"\")","v":0.89489376879780669},{"$f":"+IFERROR(VLOOKUP(C8,'Títulos Elegibles'!$A$3:$G$9,7,FALSE),\"\")","v":3.1E-2},{"$f":"+IFERROR(VLOOKUP(C8,'Títulos Elegibles'!$A$3:$I$9,9,FALSE),\"\")","v":8.611111111111111E-4},{"$f":"IFERROR(E8*F8+H8*E8,0)","v":1791509.7598178356},{"$f":"+IFERROR(ROUND(IF(D8=\"USD\",I8*$C$18/$C$19,IF(D8=\"UP\",I8*$C$20/$C$19,I8)),2),\"\")","v":11646560.42}]
[null,{"$f":"+IFERROR(VLOOKUP(C9,'Títulos Elegibles'!$A$3:$B$9,2,FALSE),\"\")","v":"T"},"FF CORPORACION VIAL DEL URUGUAY I UI SI",{"$f":"IFERROR(+VLOOKUP(C9,'Títulos Elegibles'!$A$3:$I$9,6,FALSE),\"\")","v":"UI"},30000000,{"$f":"+IFERROR(VLOOKUP($C9,'Títulos Elegibles'!$A$3:$H$9,8,FALSE),\"\")","v":0.98795240501658543},{"$f":"+IFERROR(VLOOKUP(C9,'Títulos Elegibles'!$A$3:$G$9,7,FALSE),\"\")","v":2.75E-2},{"$f":"+IFERROR(VLOOKUP(C9,'Títulos Elegibles'!$A$3:$I$9,9,FALSE),\"\")","v":7.6388888888888882E-4},{"$f":"IFERROR(E9*F9+H9*E9,0)","v":29661488.817164231},{"$f":"+IFERROR(ROUND(IF(D9=\"USD\",I9*$C$18/$C$19,IF(D9=\"UP\",I9*$C$20/$C$19,I9)),2),\"\")","v":29661488.82}]
[null,{"$f":"+IFERROR(VLOOKUP(C10,'Títulos Elegibles'!$A$3:$B$9,2,FALSE),\"\")","v":"T"},"FF CORPORACION VIAL DEL URUGUAY I US SIII",{"$f":"IFERROR(+VLOOKUP(C10,'Títulos Elegibles'!$A$3:$I$9,6,FALSE),\"\")","v":"USD"},1000000,{"$f":"+IFERROR(VLOOKUP($C10,'Títulos Elegibles'!$A$3:$H$9,8,FALSE),\"\")","v":0.89489376879780669},{"$f":"+IFERROR(VLOOKUP(C10,'Títulos Elegibles'!$A$3:$G$9,7,FALSE),\"\")","v":3.1E-2},{"$f":"+IFERROR(VLOOKUP(C10,'Títulos Elegibles'!$A$3:$I$9,9,FALSE),\"\")","v":8.611111111111111E-4},895754.87990891782,{"$f":"+IFERROR(ROUND(IF(D10=\"USD\",I10*$C$18/$C$19,IF(D10=\"UP\",I10*$C$20/$C$19,I10)),2),\"\")","v":5823280.21}]
[null,{"$f":"+IFERROR(VLOOKUP(C11,'Títulos Elegibles'!$A$3:$B$9,2,FALSE),\"\")","v":""},null,{"$f":"IFERROR(+VLOOKUP(C11,'Títulos Elegibles'!$A$3:$I$9,6,FALSE),\"\")","v":""},null,{"$f":"+IFERROR(VLOOKUP($C11,'Títulos Elegibles'!$A$3:$H$9,8,FALSE),\"\")","v":""},{"$f":"+IFERROR(VLOOKUP(C11,'Títulos Elegibles'!$A$3:$G$9,7,FALSE),\"\")","v":""},{"$f":"+IFERROR(VLOOKUP(C11,'Títulos Elegibles'!$A$3:$I$9,9,FALSE),\"\")","v":""},0,0]
[null,{"$f":"+IFERROR(VLOOKUP(C12,'Títulos Elegibles'!$A$3:$B$9,2,FALSE),\"\")","v":""},null,{"$f":"IFERROR(+VLOOKUP(C12,'Títulos Elegibles'!$A$3:$I$9,6,FALSE),\"\")","v":""},null,{"$f":"+IFERROR(VLOOKUP($C12,'Títulos Elegibles'!$A$3:$H$9,8,FALSE),\"\")","v":""},{"$f":"+IFERROR(VLOOKUP(C12,'Títulos Elegibles'!$A$3:$G$9,7,FALSE),\"\")","v":""},{"$f":"+IFERROR(VLOOKUP(C12,'Títulos Elegibles'!$A$3:$I$9,9,FALSE),\"\")","v":""},0,0]
[null,{"$f":"+IFERROR(VLOOKUP(C13,'Títulos Elegibles'!$A$3:$B$9,2,FALSE),\"\")","v":""},null,{"$f":"IFERROR(+VLOOKUP(C13,'Títulos Elegibles'!$A$3:$I$9,6,FALSE),\"\")","v":""},null,{"$f":"+IFERROR(VLOOKUP($C13,'Títulos Elegibles'!$A$3:$H$9,8,FALSE),\"\")","v":""},{"$f":"+IFERROR(VLOOKUP(C13,'Títulos Elegibles'!$A$3:$G$9,7,FALSE),\"\")","v":""},{"$f":"+IFERROR(VLOOKUP(C13,'Títulos Elegibles'!$A$3:$I$9,9,FALSE),\"\")","v":""},0,0]
[null,{"$f":"+IFERROR(VLOOKUP(C14,'Títulos Elegibles'!$A$3:$B$9,2,FALSE),\"\")","v":""},null,{"$f":"IFERROR(+VLOOKUP(C14,'Títulos Elegibles'!$A$3:$I$9,6,FALSE),\"\")","v":""},null,{"$f":"+IFERROR(VLOOKUP($C14,'Títulos Elegibles'!$A$3:$H$9,8,FALSE),\"\")","v":""},{"$f":"+IFERROR(VLOOKUP(C14,'Títulos Elegibles'!$A$3:$G$9,7,FALSE),\"\")","v":""},{"$f":"+IFERROR(VLOOKUP(C14,'Títulos Elegibles'!$A$3:$I$9,9,FALSE),\"\")","v":""},0,0]
[null,null,"Total",null,null,null,null,null,null,{"$f":"SUM(J8:J14)","v":47131329.450000003},{"$f":"+IF(J15>'I. Calculadora - Oferta'!C16,\"SobreOfertado el monto\",IF(J15<'I. Calculadora - Oferta'!C16,\"Diferecia debe cubrirse con Efectivo\",\"Caje total en Títulos\"))","v":"SobreOfertado el monto"}]
[]
[null,"Cotizaciones"]
[null,"UYP/USD",39,"valor de cierre del 15/4/2024"]
[null,"UI",5.9991000000000003,"Valor del 25/4/24"]
[null,"UP",1.6019699999999999,"Valor del 25/4/24"]
{"$rows_left_out":14}
{"sheet":"II. Calculadora Fondeo UP","index":2,"n_rows":33,"n_cols":11,"rows_kept":33,"cut":false,"hidden":false,"merged":[]}
[]
[null,"Serie II  (UP) - Calculadora Fondeo"]
[]
[null,"I. Instrumentos Elegibles y Montos"]
[]
[null,null,null,null,null,null,null,null,"Valor","Valor "]
[null,"Codigo Título","Instrumentos","Moneda del Intrumento","Nominal","Precio","Cupón","Devengado cupón corrido","(moneda base)","(UP)"]
[null,{"$f":"+IFERROR(VLOOKUP(C8,'Títulos Elegibles'!$A$3:$B$9,2,FALSE),\"\")","v":"T"},"FF CORPORACION VIAL DEL URUGUAY I US S6",{"$f":"IFERROR(+VLOOKUP(C8,'Títulos Elegibles'!$A$3:$I$9,6,FALSE),\"\")","v":"USD"},400000,{"$f":"+IFERROR(VLOOKUP($C8,'Títulos Elegibles'!$A$3:$H$9,8,FALSE),\"\")","v":0.93602749333692759},{"$f":"+IFERROR(VLOOKUP(C8,'Títulos Elegibles'!$A$3:$G$9,7,FALSE),\"\")","v":4.4999999999999998E-2},{"$f":"+IFERROR(VLOOKUP(C8,'Títulos Elegibles'!$A$3:$I$9,9,FALSE),\"\")","v":1.2499999999999998E-3},{"$f":"IFERROR(E8*F8+H8*E8,0)","v":374910.99733477103},{"$f":"+IFERROR(ROUND(IF(D8=\"USD\",I8*$C$18/$C$20,IF(D8=\"UI\",I8*$C$19/$C$20,I8)),2),\"\")","v":9127217.6699999999}]
[null,{"$f":"+IFERROR(VLOOKUP(C9,'Títulos Elegibles'!$A$3:$B$9,2,FALSE),\"\")","v":"T"},"FF CORPORACION VIAL DEL URUGUAY I USD",{"$f":"IFERROR(+VLOOKUP(C9,'Títulos Elegibles'!$A$3:$I$9,6,FALSE),\"\")","v":"USD"},1500000,{"$f":"+IFERROR(VLOOKUP($C9,'Títulos Elegibles'!$A$3:$H$9,8,FALSE),\"\")","v":0.95936009220806651},{"$f":"+IFERROR(VLOOKUP(C9,'Títulos Elegibles'!$A$3:$G$9,7,FALSE),\"\")","v":4.9000000000000002E-2},{"$f":"+IFERROR(VLOOKUP(C9,'Títulos Elegibles'!$A$3:$I$9,9,FALSE),\"\")","v":1.3611111111111111E-3},{"$f":"IFERROR(E9*F9+H9*E9,0)","v":1441081.8049787665},{"$f":"+IFERROR(ROUND(IF(D9=\"USD\",I9*$C$18/$C$20,IF(D9=\"UI\",I9*$C$19/$C$20,I9)),2),\"\")","v":35083172.840000004}]
[null,{"$f":"+IFERROR(VLOOKUP(C10,'Títulos Elegibles'!$A$3:$B$9,2,FALSE),\"\")","v":""},null,{"$f":"IFERROR(+VLOOKUP(C10,'Títulos Elegibles'!$A$3:$I$9,6,FALSE),\"\")","v":""},null,{"$f":"+IFERROR(VLOOKUP($C10,'Títulos Elegibles'!$A$3:$H$9,8,FALSE),\"\")","v":""},{"$f":"+IFERROR(VLOOKUP(C10,'Títulos Elegibles'!$A$3:$G$9,7,FALSE),\"\")","v":""},{"$f":"+IFERROR(VLOOKUP(C10,'Títulos Elegibles'!$A$3:$I$9,9,FALSE),\"\")","v":""},0,0]
[null,{"$f":"+IFERROR(VLOOKUP(C11,'Títulos Elegibles'!$A$3:$B$9,2,FALSE),\"\")","v":""},null,{"$f":"IFERROR(+VLOOKUP(C11,'Títulos Elegibles'!$A$3:$I$9,6,FALSE),\"\")","v":""},null,{"$f":"+IFERROR(VLOOKUP($C11,'Títulos Elegibles'!$A$3:$H$9,8,FALSE),\"\")","v":""},{"$f":"+IFERROR(VLOOKUP(C11,'Títulos Elegibles'!$A$3:$G$9,7,FALSE),\"\")","v":""},{"$f":"+IFERROR(VLOOKUP(C11,'Títulos Elegibles'!$A$3:$I$9,9,FALSE),\"\")","v":""},0,0]
[null,{"$f":"+IFERROR(VLOOKUP(C12,'Títulos Elegibles'!$A$3:$B$9,2,FALSE),\"\")","v":""},null,{"$f":"IFERROR(+VLOOKUP(C12,'Títulos Elegibles'!$A$3:$I$9,6,FALSE),\"\")","v":""},null,{"$f":"+IFERROR(VLOOKUP($C12,'Títulos Elegibles'!$A$3:$H$9,8,FALSE),\"\")","v":""},{"$f":"+IFERROR(VLOOKUP(C12,'Títulos Elegibles'!$A$3:$G$9,7,FALSE),\"\")","v":""},{"$f":"+IFERROR(VLOOKUP(C12,'Títulos Elegibles'!$A$3:$I$9,9,FALSE),\"\")","v":""},0,0]
[null,{"$f":"+IFERROR(VLOOKUP(C13,'Títulos Elegibles'!$A$3:$B$9,2,FALSE),\"\")","v":""},null,{"$f":"IFERROR(+VLOOKUP(C13,'Títulos Elegibles'!$A$3:$I$9,6,FALSE),\"\")","v":""},null,{"$f":"+IFERROR(VLOOKUP($C13,'Títulos Elegibles'!$A$3:$H$9,8,FALSE),\"\")","v":""},{"$f":"+IFERROR(VLOOKUP(C13,'Títulos Elegibles'!$A$3:$G$9,7,FALSE),\"\")","v":""},{"$f":"+IFERROR(VLOOKUP(C13,'Títulos Elegibles'!$A$3:$I$9,9,FALSE),\"\")","v":""},0,0]
[null,{"$f":"+IFERROR(VLOOKUP(C14,'Títulos Elegibles'!$A$3:$B$9,2,FALSE),\"\")","v":""},null,{"$f":"IFERROR(+VLOOKUP(C14,'Títulos Elegibles'!$A$3:$I$9,6,FALSE),\"\")","v":""},null,{"$f":"+IFERROR(VLOOKUP($C14,'Títulos Elegibles'!$A$3:$H$9,8,FALSE),\"\")","v":""},{"$f":"+IFERROR(VLOOKUP(C14,'Títulos Elegibles'!$A$3:$G$9,7,FALSE),\"\")","v":""},{"$f":"+IFERROR(VLOOKUP(C14,'Títulos Elegibles'!$A$3:$I$9,9,FALSE),\"\")","v":""},0,0]
[null,null,"Total",null,null,null,null,null,null,{"$f":"SUM(J8:J14)","v":44210390.510000005},{"$f":"+IF(I14>'I. Calculadora - Oferta'!M16,\"SobreOfertado el monto\",IF(I14<'I. Calculadora - Oferta'!M16,\"Diferecia debe cubrirse con Efectivo\",\"Caje total en Títulos\"))","v":"Diferecia debe cubrirse con Efectivo"}]
[]
[null,"Cotizaciones"]
[null,"UYP/USD",{"$f":"+'I. Calculadora Fondeo UI'!C18","v":39},"valor de cierre del 15/4/2024"]
[null,"UI",{"$f":"+'I. Calculadora Fondeo UI'!C19","v":5.9991000000000003},"Valor del 25/4/24"]
[null,"UP",{"$f":"+'I. Calculadora Fondeo UI'!C20","v":1.6019699999999999},"Valor del 25/4/24"]
{"$rows_left_out":14}
{"sheet":"III. Calculadora Fondeo USD","index":3,"n_rows":33,"n_cols":11,"rows_kept":33,"cut":false,"hidden":false,"merged":[]}
[]
[null,"Serie III  (USD) - Calculadora Fondeo"]
[]
[null,"I. Instrumentos Elegibles y Montos"]
[]
[null,null,null,null,null,null,null,null,"Valor","Valor "]
[null,"Codigo Título","Instrumentos","Moneda del Intrumento","Nominal","Precio","Cupón","Devengado cupón corrido","(moneda base)","(USD)"]
[null,{"$f":"+IFERROR(VLOOKUP(C8,'Títulos Elegibles'!$A$3:$B$9,2,FALSE),\"\")","v":"T"},"FF CORPORACION VIAL DEL URUGUAY I USD",{"$f":"IFERROR(+VLOOKUP(C8,'Títulos Elegibles'!$A$3:$I$9,6,FALSE),\"\")","v":"USD"},750000,{"$f":"+IFERROR(VLOOKUP($C8,'Títulos Elegibles'!$A$3:$H$9,8,FALSE),\"\")","v":0.95936009220806651},{"$f":"+IFERROR(VLOOKUP(C8,'Títulos Elegibles'!$A$3:$G$9,7,FALSE),\"\")","v":4.9000000000000002E-2},{"$f":"+IFERROR(VLOOKUP(C8,'Títulos Elegibles'!$A$3:$I$9,9,FALSE),\"\")","v":1.3611111111111111E-3},{"$f":"IFERROR(E8*F8+H8*E8,0)","v":720540.90248938324},{"$f":"+IFERROR(ROUND(IF(D8=\"UP\",I8*$C$20/$C$18,IF(D8=\"UI\",I8*$C$19/$C$18,I8)),2),\"\")","v":720540.9}]
[null,{"$f":"+IFERROR(VLOOKUP(C9,'Títulos Elegibles'!$A$3:$B$9,2,FALSE),\"\")","v":"T"},"FF CORPORACION VIAL DEL URUGUAY I US S4",{"$f":"IFERROR(+VLOOKUP(C9,'Títulos Elegibles'!$A$3:$I$9,6,FALSE),\"\")","v":"USD"},2000000,{"$f":"+IFERROR(VLOOKUP($C9,'Títulos Elegibles'!$A$3:$H$9,8,FALSE),\"\")","v":0.95935991704244206},{"$f":"+IFERROR(VLOOKUP(C9,'Títulos Elegibles'!$A$3:$G$9,7,FALSE),\"\")","v":4.9000000000000002E-2},{"$f":"+IFERROR(VLOOKUP(C9,'Títulos Elegibles'!$A$3:$I$9,9,FALSE),\"\")","v":1.3611111111111111E-3},{"$f":"IFERROR(E9*F9+H9*E9,0)","v":1921442.0563071063},{"$f":"+IFERROR(ROUND(IF(D9=\"UP\",I9*$C$20/$C$18,IF(D9=\"UI\",I9*$C$19/$C$18,I9)),2),\"\")","v":1921442.06}]
[null,{"$f":"+IFERROR(VLOOKUP(C10,'Títulos Elegibles'!$A$3:$B$9,2,FALSE),\"\")","v":"T"},"FF CORPORACION VIAL DEL URUGUAY I US S6",{"$f":"IFERROR(+VLOOKUP(C10,'Títulos Elegibles'!$A$3:$I$9,6,FALSE),\"\")","v":"USD"},null,{"$f":"+IFERROR(VLOOKUP($C10,'Títulos Elegibles'!$A$3:$H$9,8,FALSE),\"\")","v":0.93602749333692759},{"$f":"+IFERROR(VLOOKUP(C10,'Títulos Elegibles'!$A$3:$G$9,7,FALSE),\"\")","v":4.4999999999999998E-2},{"$f":"+IFERROR(VLOOKUP(C10,'Títulos Elegibles'!$A$3:$I$9,9,FALSE),\"\")","v":1.2499999999999998E-3},0,0]
[null,{"$f":"+IFERROR(VLOOKUP(C11,'Títulos Elegibles'!$A$3:$B$9,2,FALSE),\"\")","v":""},null,{"$f":"IFERROR(+VLOOKUP(C11,'Títulos Elegibles'!$A$3:$I$9,6,FALSE),\"\")","v":""},null,{"$f":"+IFERROR(VLOOKUP($C11,'Títulos Elegibles'!$A$3:$H$9,8,FALSE),\"\")","v":""},{"$f":"+IFERROR(VLOOKUP(C11,'Títulos Elegibles'!$A$3:$G$9,7,FALSE),\"\")","v":""},{"$f":"+IFERROR(VLOOKUP(C11,'Títulos Elegibles'!$A$3:$I$9,9,FALSE),\"\")","v":""},0,0]
[null,{"$f":"+IFERROR(VLOOKUP(C12,'Títulos Elegibles'!$A$3:$B$9,2,FALSE),\"\")","v":""},null,{"$f":"IFERROR(+VLOOKUP(C12,'Títulos Elegibles'!$A$3:$I$9,6,FALSE),\"\")","v":""},null,{"$f":"+IFERROR(VLOOKUP($C12,'Títulos Elegibles'!$A$3:$H$9,8,FALSE),\"\")","v":""},{"$f":"+IFERROR(VLOOKUP(C12,'Títulos Elegibles'!$A$3:$G$9,7,FALSE),\"\")","v":""},{"$f":"+IFERROR(VLOOKUP(C12,'Títulos Elegibles'!$A$3:$I$9,9,FALSE),\"\")","v":""},0,0]
[null,{"$f":"+IFERROR(VLOOKUP(C13,'Títulos Elegibles'!$A$3:$B$9,2,FALSE),\"\")","v":""},null,{"$f":"IFERROR(+VLOOKUP(C13,'Títulos Elegibles'!$A$3:$I$9,6,FALSE),\"\")","v":""},null,{"$f":"+IFERROR(VLOOKUP($C13,'Títulos Elegibles'!$A$3:$H$9,8,FALSE),\"\")","v":""},{"$f":"+IFERROR(VLOOKUP(C13,'Títulos Elegibles'!$A$3:$G$9,7,FALSE),\"\")","v":""},{"$f":"+IFERROR(VLOOKUP(C13,'Títulos Elegibles'!$A$3:$I$9,9,FALSE),\"\")","v":""},0,0]
[null,{"$f":"+IFERROR(VLOOKUP(C14,'Títulos Elegibles'!$A$3:$B$9,2,FALSE),\"\")","v":""},null,{"$f":"IFERROR(+VLOOKUP(C14,'Títulos Elegibles'!$A$3:$I$9,6,FALSE),\"\")","v":""},null,{"$f":"+IFERROR(VLOOKUP($C14,'Títulos Elegibles'!$A$3:$H$9,8,FALSE),\"\")","v":""},{"$f":"+IFERROR(VLOOKUP(C14,'Títulos Elegibles'!$A$3:$G$9,7,FALSE),\"\")","v":""},{"$f":"+IFERROR(VLOOKUP(C14,'Títulos Elegibles'!$A$3:$I$9,9,FALSE),\"\")","v":""},0,0]
[null,null,"Total",null,null,null,null,null,null,{"$f":"SUM(J8:J14)","v":2641982.96},{"$f":"+IF(I14>'I. Calculadora - Oferta'!M16,\"SobreOfertado el monto\",IF(I14<'I. Calculadora - Oferta'!M16,\"Diferecia debe cubrirse con Efectivo\",\"Caje total en Títulos\"))","v":"Diferecia debe cubrirse con Efectivo"}]
[]
[null,"Cotizaciones"]
[null,"UYP/USD",{"$f":"+'I. Calculadora Fondeo UI'!C18","v":39},"valor de cierre del 15/4/2024"]
[null,"UI",{"$f":"+'I. Calculadora Fondeo UI'!C19","v":5.9991000000000003},"Valor del 25/4/24",null,null,null,null,null,{"$f":"+J27*0.98","v":2589143.3007999999}]
[null,"UP",{"$f":"+'I. Calculadora Fondeo UI'!C20","v":1.6019699999999999},"Valor del 25/4/24",null,null,null,null,null,{"$f":"+J27*0.02","v":52839.659200000002}]
{"$rows_left_out":14}
{"sheet":"Títulos Elegibles","index":4,"n_rows":12,"n_cols":9,"rows_kept":12,"cut":false,"hidden":false,"merged":[]}
[]
["NOMBRE ISIN","Codigo Título","ISIN","Fecha de Emisión","Último Pago de Cupón","Moneda","Cupón","Precio*","Devengado"]
["FF CORPORACION VIAL DEL URUGUAY I USD","T","UYFFRA083US1","2017-04-26","2024-04-15","USD",4.9000000000000002E-2,0.95936009220806651,{"$f":"+DAYS360(E3,\"25/04/2024\")/360*G3","v":1.3611111111111111E-3}]
["FF CORPORACION VIAL DEL URUGUAY I US S4","T","UYFFCA101US8","2018-04-30","2024-04-15","USD",4.9000000000000002E-2,0.95935991704244206,{"$f":"+DAYS360(E4,\"25/04/2024\")/360*G4","v":1.3611111111111111E-3}]
["FF CORPORACION VIAL DEL URUGUAY I US S6","T","UYFFCN121US1","2019-05-03","2024-04-15","USD",4.4999999999999998E-2,0.93602749333692759,1.2499999999999998E-3]
["FF CORPORACION VIAL DEL URUGUAY I UI SI","T","UYFFCN150UI1","2021-06-24","2024-04-15","UI",2.75E-2,0.98795240501658543,7.6388888888888882E-4]
["FF CORPORACION VIAL DEL URUGUAY I UP SII","T","UYFFCN151UP4","2021-06-24","2024-04-15","UP",0.02,1.0116774337737251,5.5555555555555556E-4]
["FF CORPORACION VIAL DEL URUGUAY I US SIII","T","UYFFCN152US6","2021-06-24","2024-04-15","USD",3.1E-2,0.89489376879780669,8.611111111111111E-4]
["Fideicomiso de Oferta Privada CVU II serie I","T","-","2023-07-20","2024-04-01","UP",2.2700000000000001E-2,1.0098,1.5133333333333333E-3]
[]
[null,null,null,null,null,null,null,"* precio fijado por el emisor, comunicado al mercado el 15/4/2024"]
["EFECTIVO","E"]